{"text_format":"1","workbook":"xlsx","n_sheets":5,"sheets":["Contents","Inputs","DL linkLevel","UL linkLevel","Sources"],"not_rendered":{"charts":2,"images":3,"macros":1,"external_links":1,"defined_names":60,"comments":0,"pivot_tables":0},"unopened":[],"bounds":{"document_bytes":16777216,"sheet_cells":100000,"rows_first":2000,"rows_last":500,"rows_between":2000,"halvings":0,"cell_chars":16384,"cell_head_chars":4096},"cells_cut":0,"cells_raw":0,"read":"whole","date_system":"1900"}

{"sheet":"Contents","index":0,"n_rows":20,"n_cols":6,"rows_kept":20,"cut":false,"hidden":false,"merged":[[19,0,19,4]]}
[]
[null,null,null,null,null,{"$f":"Workbook.Title","v":"Single User Throughput in 5G NR"}]
[]
["Information"]
[]
["Title ","Single User Throughput in 5G NR"]
["Objective","To compare throughput for different spectrum options"]
["Status","Approved for release"]
[]
["Contents"]
[]
["Sheet","Description"]
["Contents","This contents sheet"]
["Inputs","Input parameters used in calculation sheets"]
["DL linkLevel","Calculation sheet for Downlink throughput calculations"]
["UL linkLevel","Calculation sheet for Uplink throughput calculations"]
["Sources","Sources of equations and parameters taken from 3gpp references"]
[]
["Terms and conditions"]
["The terms and conditions on which OFCOM is making available the model are set out below.\n\nThe SUT model provided has been developed to calculate the single user throughput for different spectrum scenarios and compare against differentservice throughput requirements.\n\nAll right, title and interest in the provided model (the ‘Model’) constructed in Excel to calculate SUT are owned by OFCOM. Such title and interest is protected by United Kingdom intellectual property laws and international treaty provisions. While you may freely use the Model for the purposes for which it is provided, as set out in the accompanying model documentation, it is not to be modified in any way or used for commercial gain or otherwise without the prior written permission of OFCOM.\n\nNo representation or warranty is given as to the accuracy, completeness or correctness of the provided Model and it is provided 'as is'. It is provided without any representation or endorsement made and without warranty of any kind, whether express or implied, including but not limited to the implied warranties of satisfactory quality, fitness for a particular purpose, non-infringement, compatibility, security and accuracy.\n\nOFCOM does not accept any responsibility for any loss, disruption or damage to your data or your computer system which may occur whilst using the Model or material derived from the Model. OFCOM does not warrant that the functions contained in the Model will be uninterrupted or error free. Also, OFCOM does not warrant that defects will be corrected, or that the Model provided is free of viruses.\n\nIn no event will OFCOM be liable for any loss or damage including, without limitation, indirect or consequential loss or damage, or any loss or damages whatsoever arising from use or loss of use of, data or profits arising out of or in connection with the use or otherwise of the provided Model. By using this Model, you agree to the above."]
{"$rows_left_out":1}
{"sheet":"Inputs","index":1,"n_rows":102,"n_cols":16,"rows_kept":102,"cut":false,"hidden":false,"merged":[[26,3,31,3],[33,3,38,3],[10,12,10,14],[96,7,96,11],[84,7,84,11],[4,7,4,14],[18,6,18,7],[18,8,18,9]]}
["Input Parameters"]
[null,"All parameters are described in detail in Annex 2 of the associated consultation"]
[null,"Lookup Tables"]
[null,null,"Yes","No",null," 3GPP  TS 38.101 Maximum Tx BW configuration NRB Table 5.3.2-1 "]
[null,null,null,null,null,null,null,"BW (MHz)"]
[null,null,"table offset",null,null,"Sub carrier spacing (SCS) (kHz)","MU (numerology)",5,10,20,40,50,70,80,100]
[null,{"$f":"B44","v":"DL 0.75 New"},1,null,null,15,0,25,null,106,216,270,"N/A","NA","NA"]
[null,{"$f":"B54","v":"DL 0.75 Original"},11,null,null,30,1,11,24,51,106,133,189,217,273]
[null,{"$f":"B64","v":"UL New"},1,null,null,60,2,"NA",11,24,"NA",65,93,107,135]
[null,{"$f":"B74","v":"UL Original"},11]
[null,null,null,null,null,null,"QPSK","16QAM","64QAM","256QAM",null,null,"Base station"]
[null,null,null,null,null,"Qm options",2,4,6,8,null,null,"Macro","Micro","Small Indoor"]
[null,null,null,null,null,null,null,null,null,null,null,"BS power (dBm/20 MHz)",71,24,{"$f":"24-6","v":18}]
[null,null,null,null,null,"f options",1,0.8,0.75,0.4,null,"BS NF (dB)",5,7,9,"Equation 14.6, §14.4, “LTE for UMTS: Evolution to LTE-Advanced”, Harri Holma and Antti Toskala, Wiley, Second edition, 2011."]
[null,null,null,null,null,null,null,null,null,null,null,"BS gain (dBi)",21,3,0]
[]
[]
[]
[null,"General Parameters",null,null,null,null,"Downlink",null,"Uplink"]
[null,"Base Station","Macro","BS_type",null,"Throughput Parameters"]
{"$rows_left_out":83}
{"sheet":"DL linkLevel","index":2,"n_rows":77,"n_cols":52,"rows_kept":77,"cut":false,"hidden":false,"merged":[[16,2,16,3],[17,2,17,3],[24,6,24,8],[24,21,24,25],[2,5,2,6],[24,9,24,11],[24,12,24,14],[24,15,24,17],[24,18,24,20]]}
["Downlink Link Level Throughput Calculations"]
[null,null,null,null,null,"Plot configurations check"]
[null,"Parameter",null,null,null,"DL 0.75 New - SINR "]
[null,"BS type",{"$f":"BS_type","v":"Macro"},"change on Inputs sheet",null,{"$f":"VLOOKUP('DL linkLevel'!$F$3,Inputs!$B$86:$L$94,3,FALSE)","v":"Macro"},{"$f":"F4=C4","v":true}]
[null,"DL/UL ratio",0.75,"DL_ratio",null,{"$f":"VLOOKUP('DL linkLevel'!$F$3,Inputs!$B$86:$L$94,2,FALSE)","v":0.75},{"$f":"F5=C5","v":true}]
[null,"Scale Power","No","DL_scale",null,{"$f":"VLOOKUP('DL linkLevel'!$F$3,Inputs!$B$86:$L$94,6,FALSE)","v":"No"},{"$f":"F6=C6","v":true}]
[null,"Plot","SINR per layer (dB)","DL_Plot",null,{"$f":"VLOOKUP('DL linkLevel'!$F$3,Inputs!$B$86:$L$94,5,FALSE)","v":"SINR per layer (dB)"},{"$f":"F7=C7","v":true}]
[null,"Plot title",{"$f":"CONCATENATE(\"Downlink SUT Distribution (Downlink \",DL_ratio*100,\"%)\")","v":"Downlink SUT Distribution (Downlink 75%)"}]
[]
[null,"Services","Mbps","Plot?"]
[null,{"$f":"Inputs!B28","v":"Mobile broadband live video"},{"$f":"Inputs!C28","v":300},"Yes",null,{"$f":"VLOOKUP('DL linkLevel'!$F$3,Inputs!$B$86:$L$94,7,FALSE)","v":"Yes"},{"$f":"F11=D11","v":true}]
[null,{"$f":"Inputs!B29","v":"Professional mobile video 8K 2D; Cloud VR 2K@90fps"},{"$f":"Inputs!C29","v":100},"Yes",null,{"$f":"VLOOKUP('DL linkLevel'!$F$3,Inputs!$B$86:$L$94,8,FALSE)","v":"Yes"},{"$f":"F12=D12","v":true}]
[null,{"$f":"Inputs!B30","v":"Cloud computer games for connected vehicles with 4K 3D graphics; Professional mobile video 4K 3D; Cloud VR 1018p@60fps"},{"$f":"Inputs!C30","v":50},"Yes",null,{"$f":"VLOOKUP('DL linkLevel'!$F$3,Inputs!$B$86:$L$94,9,FALSE)","v":"Yes"},true]
[null,{"$f":"Inputs!B31","v":"Professional mobile video 4K 2D"},{"$f":"Inputs!C31","v":25},"Yes",null,{"$f":"VLOOKUP('DL linkLevel'!$F$3,Inputs!$B$86:$L$94,10,FALSE)","v":"Yes"},true]
[null,{"$f":"Inputs!B32","v":"Cloud VR 720p@30fps"},{"$f":"Inputs!C32","v":20},"Yes",null,{"$f":"VLOOKUP('DL linkLevel'!$F$3,Inputs!$B$86:$L$94,11,FALSE)","v":"Yes"},true]
[]
[null,"Spectrum Scenarios","DL 0.75 New",null,null,{"$f":"VLOOKUP('DL linkLevel'!$F$3,Inputs!$B$86:$L$94,4,FALSE)","v":"DL 0.75 New"},{"$f":"F17=C17","v":true}]
[null,"lookup offset",{"$f":"VLOOKUP('DL linkLevel'!C17,Inputs!B7:C8,2,FALSE)","v":1},null,"DL_scenario_offset",null,null,null,"lookuptable offset",2,2]
[null,null,"No. Layers","SCS (kHz)","BW1 (MHz)","BW2 (MHz)","CA Scaling (reduce 6% if 2 carriers)","total carrier BW","mu (factor for the throughput calc)","NRB1 (looked up from table  based on BW1, SCS hard coded)","NRB2 (looked up from table above based on BW2, SCS hard coded)","Max_tput (Mbps) calc based on 5G NR throughput rate calc","Transmission BW (MHz)","spec Efficiency/ T-BW layer @100% (bps/Hz) ","SINR scaling for Power/carriers","Scenario description"]
[1,"Scenario 1",{"$f":"HLOOKUP(C$19,Inputs!$B$45:$F$60,DL_scenario_offset+$A20,FALSE)","v":4},{"$f":"HLOOKUP(D$19,Inputs!$B$45:$F$60,DL_scenario_offset+$A20,FALSE)","v":30},{"$f":"HLOOKUP(E$19,Inputs!$B$45:$F$60,DL_scenario_offset+$A20,FALSE)","v":40},{"$f":"HLOOKUP(F$19,Inputs!$B$45:$F$60,DL_scenario_offset+$A20,FALSE)","v":0},{"$f":"IF(F20=0,1,1-CA_Loss)","v":1},{"$f":"SUM(E20:F20)","v":40},{"$f":"VLOOKUP(D20,Inputs!$F$7:$G$9,2,FALSE)","v":1},{"$f":"IF(E20>0,HLOOKUP(E20,Inputs!$H$6:$O$9,$I20+$J$18,FALSE),)","v":106},{"$f":"IF(F20>0,HLOOKUP(F20,Inputs!$H$6:$O$9,$I20+$J$18,FALSE),)","v":0},{"$f":"C20*DL_ratio*DL_Qm*DL_f*DL_Rmax*(1-DL_OH)*Symbols*Subcarriers*(2^I20)*(J20+K20)/1000","v":680.55498},{"$f":"((D20*Subcarriers*J20)+(D20*Subcarriers*K20))/1000","v":38.159999999999997},{"$f":"L20/(M20*C20*DL_ratio)","v":5.9447500000000009},{"$f":"IF(DL_scale=\"Yes\",DL_NormBW*DL_NormLayers/(M20*C20),1)","v":1},{"$f":"HLOOKUP(P$19,Inputs!$B$45:$G$60,DL_scenario_offset+$A20,FALSE)","v":"Single carrier, 4 layers, scs 30 kHz, 40 MHz"}]
{"$rows_left_out":58}
{"sheet":"UL linkLevel","index":3,"n_rows":67,"n_cols":26,"rows_kept":67,"cut":false,"hidden":false,"merged":[[24,21,24,25],[2,5,2,6],[24,12,24,14],[24,15,24,17],[24,18,24,20],[16,2,16,3],[17,2,17,3],[24,6,24,8],[24,9,24,11]]}
["Uplink Link Level Throughput Calculations"]
[null,null,null,null,null,"Plot configurations check"]
[null,"Parameter",null,null,null,"UL 0.25 New  - SINR"]
[null,"BS type",{"$f":"BS_type","v":"Macro"},"change on Inputs sheet",null,{"$f":"VLOOKUP('UL linkLevel'!$F$3,Inputs!$B$98:$L$106,3,FALSE)","v":"Macro"},{"$f":"F4=C4","v":true}]
[null,"DL/UL ratio",0.25,"UL_ratio",null,{"$f":"VLOOKUP('UL linkLevel'!$F$3,Inputs!$B$98:$L$106,2,FALSE)","v":0.25},{"$f":"F5=C5","v":true}]
[null,"Scale Power","No","UL_scale",null,{"$f":"VLOOKUP('UL linkLevel'!$F$3,Inputs!$B$98:$L$106,6,FALSE)","v":"No"},{"$f":"F6=C6","v":true}]
[null,"Plot","SINR per layer (dB)","UL_Plot",null,{"$f":"VLOOKUP('UL linkLevel'!$F$3,Inputs!$B$98:$L$106,5,FALSE)","v":"SINR per layer (dB)"},{"$f":"F7=C7","v":true}]
[null,"Plot title",{"$f":"CONCATENATE(\"Uplink SUT Distribution (Uplink \",UL_ratio*100,\"%)\")","v":"Uplink SUT Distribution (Uplink 25%)"}]
[]
[null,"Services","Mbps","Plot?"]
[null,{"$f":"Inputs!B35","v":"Mobile broadband live video; Cloud computer games for connected vehicles with 4K 3D graphics"},{"$f":"Inputs!C35","v":50},"Yes",null,{"$f":"VLOOKUP('UL linkLevel'!$F$3,Inputs!$B$98:$L$106,7,FALSE)","v":"Yes"},{"$f":"F11=D11","v":true}]
[null,{"$f":"Inputs!B36","v":"Industrial control"},{"$f":"Inputs!C36","v":25},"No",null,{"$f":"VLOOKUP('UL linkLevel'!$F$3,Inputs!$B$98:$L$106,8,FALSE)","v":"No"},{"$f":"F12=D12","v":true}]
[null,{"$f":"Inputs!B37","v":"Connectivity for drones"},{"$f":"Inputs!C37","v":20},"Yes",null,{"$f":"VLOOKUP('UL linkLevel'!$F$3,Inputs!$B$98:$L$106,9,FALSE)","v":"Yes"},true]
[null,{"$f":"Inputs!B38","v":0},{"$f":"Inputs!C38","v":0},"No",null,{"$f":"VLOOKUP('UL linkLevel'!$F$3,Inputs!$B$98:$L$106,10,FALSE)","v":"No"},true]
[null,{"$f":"Inputs!B39","v":0},{"$f":"Inputs!C39","v":0},"No",null,{"$f":"VLOOKUP('UL linkLevel'!$F$3,Inputs!$B$98:$L$106,11,FALSE)","v":"No"},true]
[]
[null,"Spectrum Scenarios","UL New",null,null,{"$f":"VLOOKUP('UL linkLevel'!$F$3,Inputs!$B$98:$L$106,4,FALSE)","v":"UL New"},{"$f":"F17=C17","v":true}]
[null,"lookup offset",{"$f":"VLOOKUP('UL linkLevel'!C17,Inputs!B9:'Inputs'!C10,2,FALSE)","v":1},null,"UL_scenario_offset",null,null,null,null,"lookuptable offset",2,2]
[null,null,"No. Layers","SCS (kHz)","BW1 (MHz)","BW2 (MHz)","CA Scaling (reduce 6% if 2 carriers)","total carrier BW","mu (factor for the throughput calc)","NRB1 (looked up from table above based on BW1, SCS hard coded)","NRB2 (looked up from table above based on BW2, SCS hard coded)","Max_tput (Mbps) calc based on 5G NR throughput rate calc","Transmission BW (MHz)","spec Efficiency/ T-BW layer @100% (bps/Hz) ","SINR scaling for Power/carriers","Scenario description"]
[1,"Scenario 1",{"$f":"HLOOKUP(C$19,Inputs!$B$65:$G$80,UL_scenario_offset+$A20,FALSE)","v":2},{"$f":"HLOOKUP(D$19,Inputs!$B$65:$G$80,UL_scenario_offset+$A20,FALSE)","v":30},{"$f":"HLOOKUP(E$19,Inputs!$B$65:$G$80,UL_scenario_offset+$A20,FALSE)","v":40},{"$f":"HLOOKUP(F$19,Inputs!$B$65:$G$80,UL_scenario_offset+$A20,FALSE)","v":0},{"$f":"IF(F20=0,1,1-CA_Loss)","v":1},{"$f":"SUM(E20:F20)","v":40},{"$f":"VLOOKUP(D20,Inputs!$F$7:$G$9,2,FALSE)","v":1},{"$f":"IF(E20>0,HLOOKUP(E20,Inputs!$H$6:$O$9,$I20+$K$18,FALSE),)","v":106},{"$f":"IF(F20>0,HLOOKUP(F20,Inputs!$H$6:$O$9,$I20+$K$18,FALSE),)","v":0},{"$f":"C20*UL_ratio*UL_Qm*UL_f*UL_Rmax*(1-UL_OH)*Subcarriers*Symbols*(2^I20)*(J20+K20)/1000","v":91.004445000000004},{"$f":"((D20*12*J20)+(D20*12*K20))/1000","v":38.159999999999997},{"$f":"IF(L20>0,L20/(M20*C20*UL_ratio),\"\")","v":4.7696250000000004},{"$f":"IF(UL_scale=\"Yes\",UL_NormBW*UL_NormLayers/(M20*C20),1)","v":1},{"$f":"HLOOKUP(P$19,Inputs!$B$65:$G$80,UL_scenario_offset+$A20,FALSE)","v":"Single carrier, 2 layers, scs 30 kHz, 40 MHz"}]
{"$rows_left_out":48}
{"sheet":"Sources","index":4,"n_rows":40,"n_cols":24,"rows_kept":40,"cut":false,"hidden":false,"merged":[[6,21,6,23],[24,21,24,23]]}
["Sources"]
[null,"Link level performance Model (Truncated Shannon capacity)",null,null,null,null,null,null,null,null,"5g NR Max Throughput calculations"]
[null,"Taken from Annex A to 3gpp TR 36.942 ",null,null,null,null,null,null,null,null,"Taken from  §4.1.2 in 3GPP TS 38.306"]
[]
[null,null,null,null,null,null,null,null,null,null,null,null,null,null,null,null,null,null,null,null,"Table 5.2.2.1-3: 4-bit CQI Table 2 (downlink"]
[null,null,null,null,null,null,null,null,null,null,null,null,null,null,null,null,null,null,null,null,"CQI index","modulation","code rate x 1024","efficiency"]
[null,null,null,null,null,null,null,null,null,null,null,null,null,null,null,null,null,null,null,null,0,"out of range"]
["Where:",null,null,null,null,null,null,null,null,null,null,null,null,null,null,null,null,null,null,null,1,"QPSK",78,0.15229999999999999]
["S(SINR) is the Shannon bound: S(SINR) = log2(1+SINR) (bps/Hz) and:",null,null,null,null,null,null,null,null,null,null,null,null,null,null,null,null,null,null,null,2,"QPSK",193,0.377]
["a","is the attenuation factor, representing implementation losses,",null,null,null,null,null,null,null,null,null,null,null,null,null,null,null,null,null,null,3,"QPSK",449,0.877]
["SINRmin  is the minimum SINR of the codeset (dB),",null,null,null,null,null,null,null,null,null,null,null,null,null,null,null,null,null,null,null,4,"16QAM",378,1.4765999999999999]
["Thrmax  is the maximum throughput of the codeset (bps/Hz) and",null,null,null,null,null,null,null,null,null,null,null,null,null,null,null,null,null,null,null,5,"16QAM",490,1.9140999999999999]
["SINRmax SINR at which max throughput is reached S-1 (Thrmax) (dB)",null,null,null,null,null,null,null,null,null,null,null,null,null,null,null,null,null,null,null,6,"16QAM",616,2.4062999999999999]
[null,null,null,null,null,null,null,null,null,null,null,null,null,null,null,null,null,null,null,null,7,"64QAM",466,2.7305000000000001]
[null,null,null,null,null,null,null,null,null,null,null,null,null,null,null,null,null,null,null,null,8,"64QAM",567,3.3222999999999998]
[null,"Alpha set based on:",null,null,null,null,null,null,null,null,null,null,null,null,null,null,null,null,null,null,9,"64QAM",666,3.9022999999999999]
[null,"- 1:2 antenna configurations",null,null,null,null,null,null,null,null,null,null,null,null,null,null,null,null,null,null,10,"64QAM",772,4.5233999999999996]
[null,"- Typical Urban fast fading channel model (10kmph DL, 3kmph UL)",null,null,null,null,null,null,null,null,null,null,null,null,null,null,null,null,null,null,11,"64QAM",873,5.1151999999999997]
[null,"- Link Adaptation (see table 1 for details of highest and lowest rate codes)",null,null,null,null,null,null,null,null,null,null,null,null,null,null,null,null,null,null,12,"256QAM",711,5.5547000000000004]
[null,"- Channel prediction",null,null,null,null,null,null,null,null,null,null,null,null,null,null,null,null,null,null,13,"256QAM",797,6.2266000000000004]
{"$rows_left_out":20}