{"text_format":"1","workbook":"xlsx","n_sheets":16,"sheets":["Contents","Style Guidelines","Terms and Conditions","Analysis->","1.Scenarios","2.Cost per scenario","3.Assumptions","4.Profit calcs","5.Break-even distance est","Inputs->","ECC","PIA - Duct products","PIA - Ancillary activities","PIA - Ancillary rentals","EAD costs","EAD prices"],"not_rendered":{"charts":0,"images":2,"macros":1,"external_links":2,"defined_names":237,"comments":1,"pivot_tables":0},"unopened":[],"bounds":{"document_bytes":16777216,"sheet_cells":100000,"rows_first":2000,"rows_last":500,"rows_between":2000,"halvings":0,"cell_chars":16384,"cell_head_chars":4096},"cells_cut":0,"cells_raw":0,"read":"whole","date_system":"1900"}

{"sheet":"Contents","index":0,"n_rows":29,"n_cols":6,"rows_kept":29,"cut":false,"hidden":false,"merged":[]}
[]
[null,null,null,null,null,{"$f":"Workbook.Title","v":"Indicative dig distance cost model - For publication"}]
[]
["Information"]
[]
["Title ","Indicative dig distance cost model - For publication"]
["Objective","Estimating the 'break-even' indicative dig distance for the BCMR 2019 Statement - Annex 16"]
["Status","Approved for release"]
[]
[]
["Contents"]
[]
["Sheet","Description"]
["Contents","This contents sheet"]
["Style Guidelines","A guide to the styles used in this workbook"]
{"$rows_left_out":15}
{"sheet":"Style Guidelines","index":1,"n_rows":22,"n_cols":8,"rows_kept":22,"cut":false,"hidden":false,"merged":[]}
[]
[null,null,null,null,null,null,null,"Style Guidelines"]
[]
[]
["Styles"]
[]
[]
[null,"Input",100,null,"An input to the model that it is expected the user will change (change at will)"]
[]
[null,"Output",100,null,"A key result from this part of the model (in particular one that will be used elsewhere in the model)"]
[]
[null,"Confidential",null,null,"Confidential information that has been redacted"]
[]
[null,"Advanced user styles"]
[]
{"$rows_left_out":8}
{"sheet":"Terms and Conditions","index":2,"n_rows":14,"n_cols":1,"rows_kept":14,"cut":false,"hidden":false,"merged":[[5,0,5,15],[7,0,7,15],[9,0,9,15],[11,0,11,15],[13,0,13,15]]}
["The disclosure of this sheet is only permitted to those nominated individuals and individuals occupying the roles and functional areas (and their relevant external advisers, sub-contractors and agents) listed in Annex 2 of the Undertakings given by BT to Ofcom pursuant to the Enterprise Act 2002."]
["Terms and conditions"]
[]
["The terms and conditions on which OFCOM is making available the model are set out below."]
[]
["All right, title and interest in the provided model (the ‘Model’) constructed in Excel to estimate the 'break-even distance' for the BCMR 2019 statement (dated May 2019) are owned by OFCOM. Such title and interest is protected by United Kingdom intellectual property laws and international treaty provisions. While you may freely use the Model to understand the calculations used to estimate our 'break-even distance', it is not to be modified in any way or used for commercial gain or otherwise without the prior written permission of OFCOM."]
[]
["No representation or warranty is given as to the accuracy, completeness or correctness of the provided Model and it is provided 'as is'. It is provided without any representation or endorsement made and without warranty of any kind, whether express or implied, including but not limited to the implied warranties of satisfactory quality, fitness for a particular purpose, non-infringement, compatibility, security and accuracy."]
[]
["OFCOM does not accept any responsibility for any loss, disruption or damage to your data or your computer system which may occur whilst using the Model or material derived from the Model. OFCOM does not warrant that the functions contained in the Model will be uninterrupted or error free. Also, OFCOM does not warrant that defects will be corrected, or that the Model provided is free of viruses."]
[]
["In no event will OFCOM be liable for any loss or damage including, without limitation, indirect or consequential loss or damage, or any loss or damages whatsoever arising from use or loss of use of, data or profits arising out of or in connection with the use or otherwise of the provided Model. By using this Model, you agree to the above."]
[]
["These terms and conditions shall be covered by and construed in accordance with the laws of England and Wales. Any dispute arising under these terms and conditions shall be subject to the exclusive jurisdiction of the Courts of England and Wales."]

{"sheet":"Analysis->","index":3,"n_rows":3,"n_cols":2,"rows_kept":3,"cut":false,"hidden":false,"merged":[]}
[]
[]
[null,"This sheet left blank intentionally"]

{"sheet":"1.Scenarios","index":4,"n_rows":5,"n_cols":7,"rows_kept":5,"cut":false,"hidden":false,"merged":[]}
["1) Definition of scenarios"]
[null,"Criteria",null,"Scenario 1","Scenario 2a","Scenario 2b","Scenario 3"]
[null,null,null,"Fibre connected","Duct connected with tubing","Duct connected without tubing","Network extension (new duct required)"]
[null,null,"(i) Existing infrastructure","The incremental cost to connect a new customer site when the provider has a fibre connection in place.","The incremental cost to connect a new customer site when the provider has fibre tubing in place, but not fibre.","The incremental cost to connect a new customer site when the provider has duct in place, but not fibre tubing nor fibre.","The incremental cost to connect a new customer site when the provider has no duct in place."]
[null,null,"(ii) Incremental costs","There are virtually zero incremental costs.","The main incremental cost is to blow fibre down the fibre tubing.","The main incremental cost is blown fibre tubing and blown fibre.","The main incremental cost includes the cost of digging to install a new duct, blown fibre tubing, and blown fibre."]

{"sheet":"2.Cost per scenario","index":5,"n_rows":17,"n_cols":11,"rows_kept":17,"cut":false,"hidden":false,"merged":[]}
["2) Costs per scenario"]
[null,"a) Passive costs"]
[null,null,null,"Scenario 1","Scenario 2a","Scenario 2b","Scenario 3","Frequency","Operative date","Charge £ Exc VAT"]
[null,null,"Survey","No","Yes","Yes","Yes","One-off per survey",{"$f":"ECC!B27","v":"01/04/2018"},{"$f":"ECC!D27","v":244.52},"ownnet_oneoff_survey"]
[null,null,"Blown fibre tubing","No","No","Yes","Yes","One-off per metre",{"$f":"ECC!B132","v":"01/04/2018"},{"$f":"ECC!E132","v":3.83},"ownnet_permetre_blownfibretube"]
[null,null,"Blown fibre","No","Yes","Yes","Yes","One-off per metre",{"$f":"ECC!B124","v":"01/04/2018"},{"$f":"ECC!E124","v":1.74},"ownnet_permetre_blownfibre"]
[null,null,"Duct under a footway","No","No","No","Yes","One-off per metre",{"$f":"ECC!B158","v":"01/12/2018"},{"$f":"ECC!E158","v":"66.54"},"ownnet_permetre_ductfootway"]
[null,null,"Duct under a carriage way","No","No","No","Yes","One-off per metre",{"$f":"ECC!B166","v":"01/12/2018"},{"$f":"ECC!E166","v":"119.22"},"ownnet_permetre_ductcarriageway"]
[null,null,"New footway box","No","No","No","Yes","One-off per footway box",{"$f":"ECC!B63","v":"01/10/2018"},{"$f":"ECC!D63","v":761.62},"ownnet_oneoff_footwaybox"]
[null,null,"Break through external wall(s) at the customer premise","No","No","No","Yes","One-off per break",{"$f":"ECC!B34","v":"01/04/2018"},{"$f":"ECC!D34","v":220.83},"ownnet_oneoff_breakwall"]
[null,null,"Ancilliary activity - Blockage clearance (initial) - per blockage","No","No","Yes","No","One-off per blockage",{"$f":"'PIA - Ancillary activities'!C92","v":"01/04/2019"},{"$f":"'PIA - Ancillary activities'!E92","v":577.6},"pia_perblockage_clearblock"]
[]
[null,"b) Active costs"]
[null,null,null,"Scenario 1","Scenario 2a","Scenario 2b","Scenario 3","Frequency",null,"Charge £ Exc VAT"]
[null,null,"EAD electronics equipment and installation for 100M EAD LA","Yes","Yes","Yes","Yes","Annual rental per circuit",null,{"$f":"'EAD costs'!B7","v":305.98200000000003},"act_hundredmb_int_nonwecla"]
{"$rows_left_out":3}
{"sheet":"3.Assumptions","index":6,"n_rows":25,"n_cols":6,"rows_kept":25,"cut":false,"hidden":false,"merged":[[14,5,16,5],[14,3,16,3],[5,2,6,2],[5,3,6,3],[17,2,18,2],[17,3,18,3]]}
["3. Assumptions"]
[null,"a) Passive costs assumptions"]
[null,null,"Survey",1,null,"assumption_survey"]
[null,null,"New footway box",100,null,"assumption_footwaybox"]
[null,null,"Break through external wall(s) at the customer premise",1,null,"assumption_breakwall"]
[null,null,"Ancilliary activity - Blockage clearance (initial) - per blockage","low",1.5,"assumption_blockage_low, conservative, in line with range published in 2018 WLA Market Review"]
[null,null,null,null,2,"assumption_blockage_high, conservative, in line with range published in 2018 WLA Market Review"]
[null,null,"The proportion of the duct that runs under a footway (only when a new duct is needed)",0.9,null,"assumption_proportion_duct_footway"]
[null,null,"The proportion of the duct that runs under a carriage way (only when a new duct is needed)",0.1,null,"assumption_proportion_duct_carriage_way"]
[null,null,"Route distance in metres",230.68343733529449,null,"assumption_route_distance"]
[null,null,"Length of Lead-in duct in metres",25,null,"assumption_leadinduct"]
[null,null,"Number of entries per joint box",2,null,"assumption_jointboxentry"]
[]
[null,"b) Active costs assumptions"]
[null,null,"EAD electronics equipment and installation for 100M EAD LA",1,null,"assumption_equipment"]
{"$rows_left_out":11}
{"sheet":"4.Profit calcs","index":7,"n_rows":66,"n_cols":14,"rows_kept":66,"cut":false,"hidden":false,"merged":[[41,4,41,13],[22,1,23,7]]}
["4) Profit calculations"]
[null,"a) Passive costs"]
[null,null,"Passive costs (one-offs)","Type of cost","Scenario 1","Scenario 2a","Scenario 2b","Scenario 3"]
[null,null,"Blown fibre tubing","CAPEX",0,{"$f":"IF(INDEX('2.Cost per scenario'!$E$4:$G$11,MATCH($C4,'2.Cost per scenario'!$C$4:$C$11,0),MATCH(F$3,'2.Cost per scenario'!$E$3:$G$3,0))=\"Yes\",(assumption_route_distance*ownnet_permetre_blownfibretube),0)","v":0},{"$f":"IF(INDEX('2.Cost per scenario'!$E$4:$G$11,MATCH($C4,'2.Cost per scenario'!$C$4:$C$11,0),MATCH(G$3,'2.Cost per scenario'!$E$3:$G$3,0))=\"Yes\",(assumption_route_distance*ownnet_permetre_blownfibretube),0)","v":883.51756499417786},{"$f":"IF(INDEX('2.Cost per scenario'!$E$4:$G$11,MATCH($C4,'2.Cost per scenario'!$C$4:$C$11,0),MATCH(H$3,'2.Cost per scenario'!$E$3:$G$3,0))=\"Yes\",(assumption_route_distance*ownnet_permetre_blownfibretube),0)","v":883.51756499417786}]
[null,null,"Blown fibre","CAPEX",0,{"$f":"IF(INDEX('2.Cost per scenario'!$E$4:$G$11,MATCH($C5,'2.Cost per scenario'!$C$4:$C$11,0),MATCH(F$3,'2.Cost per scenario'!$E$3:$G$3,0))=\"Yes\",(assumption_route_distance*ownnet_permetre_blownfibre),0)","v":401.3891809634124},{"$f":"IF(INDEX('2.Cost per scenario'!$E$4:$G$11,MATCH($C5,'2.Cost per scenario'!$C$4:$C$11,0),MATCH(G$3,'2.Cost per scenario'!$E$3:$G$3,0))=\"Yes\",(assumption_route_distance*ownnet_permetre_blownfibre),0)","v":401.3891809634124},{"$f":"IF(INDEX('2.Cost per scenario'!$E$4:$G$11,MATCH($C5,'2.Cost per scenario'!$C$4:$C$11,0),MATCH(H$3,'2.Cost per scenario'!$E$3:$G$3,0))=\"Yes\",(assumption_route_distance*ownnet_permetre_blownfibre),0)","v":401.3891809634124}]
[null,null,"Duct under a footway","CAPEX",0,{"$f":"IF(INDEX('2.Cost per scenario'!$E$4:$G$11,MATCH($C6,'2.Cost per scenario'!$C$4:$C$11,0),MATCH(F$3,'2.Cost per scenario'!$E$3:$G$3,0))=\"Yes\",(assumption_route_distance*ownnet_permetre_ductfootway*assumption_proportion_duct_footway),0)","v":0},{"$f":"IF(INDEX('2.Cost per scenario'!$E$4:$G$11,MATCH($C6,'2.Cost per scenario'!$C$4:$C$11,0),MATCH(G$3,'2.Cost per scenario'!$E$3:$G$3,0))=\"Yes\",(assumption_route_distance*ownnet_permetre_ductfootway*assumption_proportion_duct_footway),0)","v":0},{"$f":"IF(INDEX('2.Cost per scenario'!$E$4:$G$11,MATCH($C6,'2.Cost per scenario'!$C$4:$C$11,0),MATCH(H$3,'2.Cost per scenario'!$E$3:$G$3,0))=\"Yes\",(assumption_route_distance*ownnet_permetre_ductfootway*assumption_proportion_duct_footway),0)","v":13814.708328261446}]
[null,null,"Duct under a carriage way","CAPEX",0,{"$f":"IF(INDEX('2.Cost per scenario'!$E$4:$G$11,MATCH($C7,'2.Cost per scenario'!$C$4:$C$11,0),MATCH(F$3,'2.Cost per scenario'!$E$3:$G$3,0))=\"Yes\",(assumption_route_distance*ownnet_permetre_ductcarriageway*assumption_proportion_duct_carriage_way),0)","v":0},{"$f":"IF(INDEX('2.Cost per scenario'!$E$4:$G$11,MATCH($C7,'2.Cost per scenario'!$C$4:$C$11,0),MATCH(G$3,'2.Cost per scenario'!$E$3:$G$3,0))=\"Yes\",(assumption_route_distance*ownnet_permetre_ductcarriageway*assumption_proportion_duct_carriage_way),0)","v":0},{"$f":"IF(INDEX('2.Cost per scenario'!$E$4:$G$11,MATCH($C7,'2.Cost per scenario'!$C$4:$C$11,0),MATCH(H$3,'2.Cost per scenario'!$E$3:$G$3,0))=\"Yes\",(assumption_route_distance*ownnet_permetre_ductcarriageway*assumption_proportion_duct_carriage_way),0)","v":2750.2079399113809}]
[null,null,"New footway box","CAPEX",0,{"$f":"IF(INDEX('2.Cost per scenario'!$E$4:$G$11,MATCH($C8,'2.Cost per scenario'!$C$4:$C$11,0),MATCH(F$3,'2.Cost per scenario'!$E$3:$G$3,0))=\"Yes\",(ROUNDDOWN(assumption_route_distance/assumption_footwaybox,0)*ownnet_oneoff_footwaybox+ownnet_oneoff_footwaybox),0)","v":0},{"$f":"IF(INDEX('2.Cost per scenario'!$E$4:$G$11,MATCH($C8,'2.Cost per scenario'!$C$4:$C$11,0),MATCH(G$3,'2.Cost per scenario'!$E$3:$G$3,0))=\"Yes\",(ROUNDDOWN(assumption_route_distance/assumption_footwaybox,0)*ownnet_oneoff_footwaybox+ownnet_oneoff_footwaybox),0)","v":0},{"$f":"IF(INDEX('2.Cost per scenario'!$E$4:$G$11,MATCH($C8,'2.Cost per scenario'!$C$4:$C$11,0),MATCH(H$3,'2.Cost per scenario'!$E$3:$G$3,0))=\"Yes\",(ROUNDDOWN(assumption_route_distance/assumption_footwaybox,0)*ownnet_oneoff_footwaybox+ownnet_oneoff_footwaybox),0)","v":2284.86}]
[null,null,"Survey","OPEX",0,{"$f":"IF(INDEX('2.Cost per scenario'!$E$4:$G$11,MATCH($C9,'2.Cost per scenario'!$C$4:$C$11,0),MATCH(F$3,'2.Cost per scenario'!$E$3:$G$3,0))=\"Yes\",assumption_survey*ownnet_oneoff_survey,0)","v":244.52},{"$f":"IF(INDEX('2.Cost per scenario'!$E$4:$G$11,MATCH($C9,'2.Cost per scenario'!$C$4:$C$11,0),MATCH(G$3,'2.Cost per scenario'!$E$3:$G$3,0))=\"Yes\",assumption_survey*ownnet_oneoff_survey,0)","v":244.52},{"$f":"IF(INDEX('2.Cost per scenario'!$E$4:$G$11,MATCH($C9,'2.Cost per scenario'!$C$4:$C$11,0),MATCH(H$3,'2.Cost per scenario'!$E$3:$G$3,0))=\"Yes\",assumption_survey*ownnet_oneoff_survey,0)","v":244.52}]
[null,null,"Break through external wall(s) at the customer premise","OPEX",0,{"$f":"IF(INDEX('2.Cost per scenario'!$E$4:$G$11,MATCH($C10,'2.Cost per scenario'!$C$4:$C$11,0),MATCH(F$3,'2.Cost per scenario'!$E$3:$G$3,0))=\"Yes\",assumption_breakwall*ownnet_oneoff_breakwall,0)","v":0},{"$f":"IF(INDEX('2.Cost per scenario'!$E$4:$G$11,MATCH($C10,'2.Cost per scenario'!$C$4:$C$11,0),MATCH(G$3,'2.Cost per scenario'!$E$3:$G$3,0))=\"Yes\",assumption_breakwall*ownnet_oneoff_breakwall,0)","v":0},{"$f":"IF(INDEX('2.Cost per scenario'!$E$4:$G$11,MATCH($C10,'2.Cost per scenario'!$C$4:$C$11,0),MATCH(H$3,'2.Cost per scenario'!$E$3:$G$3,0))=\"Yes\",assumption_breakwall*ownnet_oneoff_breakwall,0)","v":220.83}]
[null,null,"Ancilliary activity - Blockage clearance (initial) - per blockage","OPEX",0,{"$f":"IF(INDEX('2.Cost per scenario'!$E$4:$G$11,MATCH($C11,'2.Cost per scenario'!$C$4:$C$11,0),MATCH(F$3,'2.Cost per scenario'!$E$3:$G$3,0))=\"Yes\",(IF(assumption_blockage_low_or_high=\"low\",assumption_blockage_low,assumption_blockage_high)*assumption_route_distance/1000*pia_perblockage_clearblock),0)","v":0},{"$f":"IF(INDEX('2.Cost per scenario'!$E$4:$G$11,MATCH($C11,'2.Cost per scenario'!$C$4:$C$11,0),MATCH(G$3,'2.Cost per scenario'!$E$3:$G$3,0))=\"Yes\",(IF(assumption_blockage_low_or_high=\"low\",assumption_blockage_low,assumption_blockage_high)*assumption_route_distance/1000*pia_perblockage_clearblock),0)","v":199.86413010729916},{"$f":"IF(INDEX('2.Cost per scenario'!$E$4:$G$11,MATCH($C11,'2.Cost per scenario'!$C$4:$C$11,0),MATCH(H$3,'2.Cost per scenario'!$E$3:$G$3,0))=\"Yes\",(IF(assumption_blockage_low_or_high=\"low\",assumption_blockage_low,assumption_blockage_high)*assumption_route_distance/1000*pia_perblockage_clearblock),0)","v":0}]
[null,null,"Total CAPEX","CAPEX",0,{"$f":"SUMIFS(F$4:F$11,$D$4:$D$11,$D12)","v":401.3891809634124},{"$f":"SUMIFS(G$4:G$11,$D$4:$D$11,$D12)","v":1284.9067459575904},20134.683014130416,"scenX_passive_capex_cost"]
[null,null,"Total OPEX","OPEX",0,{"$f":"SUMIFS(F$4:F$11,$D$4:$D$11,$D13)","v":244.52},444.38413010729914,465.35,"scenX_passive_opex_cost"]
[null,null,"Total","CAPEX + OPEX",0,{"$f":"F12+F13","v":645.90918096341238},{"$f":"G12+G13","v":1729.2908760648895},{"$f":"H12+H13","v":20600.033014130415},"scenX_passive_total_cost"]
[]
{"$rows_left_out":52}
{"sheet":"5.Break-even distance est","index":8,"n_rows":33,"n_cols":14,"rows_kept":33,"cut":false,"hidden":false,"merged":[[8,10,8,13],[8,4,8,7]]}
["5. Break-even distance estimation"]
[null,"a) Click the button below and the tables will populate automatically; or"]
[]
[]
[]
[]
[]
[]
[null,null,null,null,"Approximate break-even route distance",null,null,null,null,null,"Approximate break-even radial distance"]
[null,null,"Circuit","Payback period (years)",{"$f":"'4.Profit calcs'!D62","v":"Scenario 1"},{"$f":"'4.Profit calcs'!E62","v":"Scenario 2a"},{"$f":"'4.Profit calcs'!F62","v":"Scenario 2b"},{"$f":"'4.Profit calcs'!G62","v":"Scenario 3"},null,null,{"$f":"'4.Profit calcs'!D62","v":"Scenario 1"},{"$f":"'4.Profit calcs'!E62","v":"Scenario 2a"},{"$f":"'4.Profit calcs'!F62","v":"Scenario 2b"},{"$f":"'4.Profit calcs'!G62","v":"Scenario 3"}]
[null,null,"EAD LA 100Mbit/s",3,"Distance is not a factor",2241.2504375384324,605.89394091679742,37.702263709541114,null,null,"Distance is not a factor",{"$f":"F11/assumption_route_to_radial_distance","v":1600.8931696703089},{"$f":"G11/assumption_route_to_radial_distance","v":432.78138636914105},{"$f":"H11/assumption_route_to_radial_distance","v":26.930188363957939}]
[null,null,"EAD LA 100Mbit/s",5,"Distance is not a factor",3448.5242978281094,932.26528466548257,64.850245266366557,null,null,"Distance is not a factor",2463.2316413057924,665.90377476105903,46.321603761690398]
[null,null,"EAD LA 100Mbit/s",7,"Distance is not a factor",4483.5670449900426,1212.0761074952884,88.125263747869838,null,null,"Distance is not a factor",3202.5478892786023,865.76864821092033,62.946616962764175]
[null,null,"EAD LA 1Gbit/s",3,"Distance is not a factor",2696.1257982120046,728.86378859127581,47.931051318060533,null,null,"Distance is not a factor",1925.8041415800035,520.61699185091129,34.236465227186095]
[null,null,"EAD LA 1Gbit/s",5,"Distance is not a factor",3985.7245008674836,1077.4906207677309,76.930272577598572,null,null,"Distance is not a factor",2846.946072048203,769.63615769123635,54.950194698284697]
{"$rows_left_out":19}
{"sheet":"Inputs->","index":9,"n_rows":3,"n_cols":2,"rows_kept":3,"cut":false,"hidden":false,"merged":[]}
[]
[]
[null,"This sheet left blank intentionally"]

{"sheet":"ECC","index":10,"n_rows":214,"n_cols":5,"rows_kept":214,"cut":false,"hidden":false,"merged":[[16,0,16,4],[174,0,174,4],[179,0,179,4]]}
["Source:"]
["https://www.openreach.co.uk/orpg/home/products/pricing/loadProductPriceDetails.do?data=pAWshrQ7XRSLb9S%2BW8IAk0G8vUtdrlJTUevDC2QqJZ8lMnGHsqdC0vzO163bJmh34D91D7M0q8u%2FIlSgtIFAKw%3D%3D"]
["Price list"]
[]
[]
["Product line:","Service Product Pricing "]
["First level product:","Common products (Subject to applicable LLU/SLU/WLR/Ethernet/GEA Product Agreements)"]
["Second level product:","Excess Construction Charges"]
["Version","N/A"]
[]
[]
["Excess Construction Charges"]
[]
[]
["Excess Construction Charges"]
{"$rows_left_out":200}
{"sheet":"PIA - Duct products","index":11,"n_rows":52,"n_cols":7,"rows_kept":52,"cut":false,"hidden":false,"merged":[[11,0,11,4],[44,0,44,4]]}
["Source:"]
["https://www.openreach.co.uk/orpg/home/products/pricing/loadProductPriceDetails.do?data=z75T9D0yfFKL0UorCMMA7OVMbA8c5ofXzFv23yZvBj9Z6rNZujnCs99NbIKJZPD9hXYmiijxH6wrCQm97GZMyQ%3D%3D"]
["Price list"]
[]
[]
["Product line:","Physical Infrastructure Pricing "]
["First level product:","Physical Infrastructure Products "]
["Second level product:","Duct Products"]
["Version","N/A"]
[]
[]
["Duct Products"]
[]
["The following table contains the core products for Duct sharing. Definitions of Spine duct and Lead-in duct are contained in the Product Description.  The Licence Fee (per annum) is calculated by adding together the relevant Duct and Pole Products with the Ancillary Fees, e.g. Customer Apparatus In-line Splice hosting and distribution joints.\n  \n"]
[]
{"$rows_left_out":38}
{"sheet":"PIA - Ancillary activities","index":12,"n_rows":260,"n_cols":5,"rows_kept":260,"cut":false,"hidden":false,"merged":[[252,0,252,4]]}
["Source"]
["https://www.openreach.co.uk/orpg/home/products/pricing/loadProductPriceDetails.do?data=%2BxxzCdLXlVS2hHTfdTw%2FyFpqGjRTzjXv9ULYqsx2PF89q%2FCUHfmZJHKkF036xG69e6YShZ82RgLOGLsH2e9%2Bmw%3D%3D"]
["Price list"]
[]
[]
["Product line:","Physical Infrastructure Pricing "]
["First level product:","Physical Infrastructure Products "]
["Second level product:","New Build, Enabling Works, Ancillary Items and Network Adjustments"]
["Version","N/A"]
[]
[]
["New Build, Enabling Works, Ancillary Items and Network Adjustments"]
[]
[]
["Underground works (1)"]
{"$rows_left_out":246}
{"sheet":"PIA - Ancillary rentals","index":13,"n_rows":66,"n_cols":7,"rows_kept":66,"cut":false,"hidden":false,"merged":[[11,0,11,4],[58,0,58,4]]}
["Source"]
["https://www.openreach.co.uk/orpg/home/products/pricing/loadProductPriceDetails.do?data=5U%2BT4J34ZzADdeE3wLse8prmJTmzH7GBw64NLcFpYMdZ6rNZujnCs99NbIKJZPD9hXYmiijxH6wrCQm97GZMyQ%3D%3D"]
["Price list"]
[]
[]
["Product line:","Physical Infrastructure Pricing "]
["First level product:","Physical Infrastructure Products "]
["Second level product:","Ancillary Rentals"]
["Version","N/A"]
[]
[]
["Ancillary Rentals"]
[]
["Separate charges apply for Facility and Customer Apparatus hosting in manholes and joint boxes. The Licence Fee (per annum) is calculated by adding together the relevant Duct and Pole Products with the Ancillary Fees, e.g. Customer Apparatus In-line Splice hosting and distribution joints.\n\n  \n"]
[]
{"$rows_left_out":52}
{"sheet":"EAD costs","index":14,"n_rows":7,"n_cols":5,"rows_kept":7,"cut":false,"hidden":false,"merged":[[3,1,3,4]]}
["Source:"]
["017/18 RFS for services SD148 and SD149; and Ofcom calculations on 2017/18 AFI 4 and 2017/18 AFI 12 (A12_SERVICE MARKET and A12_Revenue Analysis) for service SD163."]
[]
[null,"Services"]
[null,"SD148","SD149","SD163 low","SD163 high"]
[null,"EAD LA 100Mbit s Rentals Rest of UK   Internal","EAD LA 1Gbit s Rentals Rest of UK   Internal","EAD 10G Rentals Rest of UK   Internal","EAD 10G Rentals Rest of UK   Internal"]
["Annual depreciation of unit FAC for cost component CO487 (Ethernet Electronics Capital) ",305.98200000000003,284.62200000000001,795.44640000000004,1193.1695999999999]

{"sheet":"EAD prices","index":15,"n_rows":1030,"n_cols":6,"rows_kept":1030,"cut":false,"hidden":false,"merged":[[554,0,554,4],[11,0,11,4],[167,0,167,4],[314,0,314,4],[319,0,319,4],[326,0,326,4],[1016,0,1016,4],[1019,0,1019,4],[1022,0,1022,4],[573,0,573,4],[872,0,872,4],[919,0,919,4],[928,0,928,4],[945,0,945,4],[1008,0,1008,4]]}
["Source:"]
["https://www.openreach.co.uk/orpg/home/products/pricing/loadProductPriceDetails.do?data=0d0zetWgShsjqKWjcN2Y5WJA8BGGqsBLxL7IgSM4fRpZ6rNZujnCs99NbIKJZPD9hXYmiijxH6wr%0ACQm97GZMyQ%3D%3D"]
["Price list"]
[]
[]
["Product line:","Ethernet services"]
["First level product:","Connectivity Services"]
["Second level product:","Ethernet Access Direct (EAD) including EAD Enable"]
["Version","N/A"]
[]
[]
["Ethernet Access Direct (EAD) including EAD Enable"]
[]
["For terms and conditions applicable to these charges payable to BT, please see the Conditions section of the Connectivity Services Contract."]
[]
{"$rows_left_out":1015}