{"text_format":"1","workbook":"xlsx","n_sheets":15,"sheets":["Version History","Quality Assurance","Style Guidelines","Contents","Style Guideline","Control","Inputs >","WLA inputs","UBC inputs","Calculations >","Non-SFBB areas","SFBB areas ","All areas","Ancillary services ","Indirect benefits"],"not_rendered":{"charts":1,"images":1,"macros":1,"external_links":2,"defined_names":72,"comments":0,"pivot_tables":0},"unopened":[],"bounds":{"document_bytes":16777216,"sheet_cells":100000,"rows_first":2000,"rows_last":500,"rows_between":2000,"halvings":0,"cell_chars":16384,"cell_head_chars":4096},"cells_cut":0,"cells_raw":0,"read":"whole","date_system":"1900"}

{"sheet":"Version History","index":0,"n_rows":6,"n_cols":4,"rows_kept":6,"cut":false,"hidden":true,"merged":[]}
[]
[null,null,null,"Version Histrory"]
[]
["History"]
[]
["Version","Date ","Author","Details of modifications introduced"]

{"sheet":"Quality Assurance","index":1,"n_rows":27,"n_cols":4,"rows_kept":27,"cut":false,"hidden":true,"merged":[]}
[]
[null,null,null,"Quality Assurance"]
[]
["Workbook QA"]
[]
["Verified by","Enter name of reviewer"]
["Date","Enter date review completed"]
["Version","Enter version of workbook checked"]
["Status","QA completed but issues to resolve"]
[]
["Type of QA","Self-check by author","Yes"]
[null,"Internal QA - informal","Yes"]
[null,"Internal QA - formal","Yes"]
[null,"External QA","Yes"]
[]
["Objective of QA","Check input data","Yes"]
[null,"Check calculations","Yes"]
[null,"Check methodology","Yes"]
[null,"Check implementation","Yes"]
[]
{"$rows_left_out":8}
{"sheet":"Style Guidelines","index":2,"n_rows":38,"n_cols":8,"rows_kept":38,"cut":false,"hidden":true,"merged":[]}
[]
[null,null,null,null,null,null,null,"Style Guidelines"]
["NB Use Window Unfreeze Panes (on each worksheet) to have row 1 scroll with the rest of the worksheet"]
[]
["Styles"]
[]
[]
[null,"Input",100,null,"An input to the model that it is expected the user will change (change at will)"]
[]
[null,"Output",100,null,"A key result from this part of the model (in particular one that will be used elsewhere in the model)"]
[]
[null,"Highlight",100,null,"A cell that is highlighted for uncertainty"]
[]
[null,"Note or Source","Note",null,"A note (NB smaller than standard font size)"]
[]
[null,"Un-format",null,null,"Going back to default Excel formatting"]
[]
[null,"Advanced user styles"]
[]
[null,"Input assumption",100,null,"An input to the model that it is expected the user will change (change at will)"]
{"$rows_left_out":19}
{"sheet":"Contents","index":3,"n_rows":41,"n_cols":6,"rows_kept":41,"cut":false,"hidden":false,"merged":[[36,0,36,2],[37,0,37,2],[38,0,38,2],[39,0,39,2],[40,0,40,2]]}
[]
[null,null,null,null,null,{"$f":"Workbook.Title","v":"Volumes "}]
[]
["Information"]
[]
["Title ","Volumes "]
["Objective","Forecast incremental GEA volumes resulting from the deployment of BT's proposed network expansion"]
["Version","Version 1.0"]
["Spreadsheet Location","http://projects/sites/wla17cc/eco/Modelling/Universal broadband/UBC volumes impact.xlsm"]
[]
["Confidentiality status","Non-confidential"]
[]
["Do you want?",false]
[null,false]
[null,false]
[]
["Contents"]
[]
["Sheet","Description"]
["Contents","Presents the workbook structure and the terms and conditions of this model"]
{"$rows_left_out":22}
{"sheet":"Style Guideline","index":4,"n_rows":16,"n_cols":8,"rows_kept":16,"cut":false,"hidden":false,"merged":[]}
[]
[null,null,null,null,null,null,null,"Style Guidelines"]
[]
[]
["Styles"]
[]
[]
[null,"Input",100,null,"An input to the model that it is expected the user will change (change at will)"]
[]
[null,"Output",100,null,"A key result from this part of the model (in particular one that will be used elsewhere in the model)"]
[]
[null,"Highlight",100,null,"A cell that is highlighted for uncertainty"]
[]
[null,"Note or Source","Note",null,"A note (NB smaller than standard font size)"]
[]
[null,"Un-format",null,null,"Going back to default Excel formatting"]

{"sheet":"Control","index":5,"n_rows":33,"n_cols":17,"rows_kept":33,"cut":false,"hidden":false,"merged":[]}
["Control",null,"Units",null,"Selected ",null,null,null,null,null," "]
[]
["Scenario",null,null,null,{"$f":"[2]Control!$H$20","v":"B1"},"UBC_scenario"]
["Techset",null,null,null,{"$f":"[2]Control!H$24","v":"LR-VDSL OFF"}]
[]
["Rollout"]
["Network deployment"]
["2017/18",null,"%",null,0]
["2018/19",null,"%",null,0.25]
["2019/20",null,"%",null,0.25]
["2020/21",null,"%",null,0.25]
["2021/22",null,"%",null,0.25]
["2022/23",null,"%",null,0]
["2023/24",null,"%",null,0]
["2024/25",null,"%",null,0]
["2025/26",null,"%",null,0]
["2026/27",null,"%",null,0]
["2027/28",null,"%",null,0]
["2028/29",null,null,null,0]
["Total",null,null,null,{"$f":"SUM(E8:E18)","v":1},"Network_rollout"]
{"$rows_left_out":14}
{"sheet":"Inputs >","index":6,"n_rows":0,"n_cols":0,"rows_kept":0,"cut":false,"hidden":false,"merged":[]}

{"sheet":"WLA inputs","index":7,"n_rows":68,"n_cols":23,"rows_kept":68,"cut":false,"hidden":false,"merged":[]}
["WLA forecasts",null,"Units ","2011/12","2012/13","2013/14","2014/15","2015/16","2016/17","2017/18","2018/19","2019/20","2020/21","2021/22","2022/23","2023/24","2024/25","2025/26","2026/27","2027/28","2028/29",null,"Source"]
[]
["Demographic inputs"]
["UK households",null,"millions",26.55035625,26.785410249999998,27.019397249999997,27.274531750000001,27.5344795,27.800326250000001,28.061114500000006,28.320592500000007,28.579025250000004,28.834594000000013,29.088779250000009,29.337651500000014,29.584850000000021,29.831990250000022,30.076997500000026,30.323541000000027,30.566214750000036,30.804670500000036,null,"WLA Volumes module"]
[]
["Total no. of lines and BB penetration"]
[]
["Total UK unadjusted OR lines",null,"millions",24.363647085594017,24.467365761318998,24.758557808652156,24.925571303332987,25.094279193518332,25.318483730822798,25.511023094454956,25.704985142883981,25.910553389956164,26.10937057009204,26.309960238484255,26.510165978483432,26.709430894088126,26.910706676032532,27.112155430155067,27.315987688878536,27.518146138911693,27.718160702772337,null,"WLA Volumes module"]
[]
["Total UK OR broadband lines",null,"millions",16.133040092343279,16.658983931763895,18.196122066733057,18.990872681666332,19.951321277685668,20.635945793621961,21.3030963431614,21.979164940379047,22.673148076661736,23.369311369534039,23.942431393199936,24.486180188491371,24.990589166796862,25.446783930815077,25.872934110991118,26.271103486817733,26.639706305856979,26.984013147630051,null,"WLA Volumes module"]
["Broadband penetration of Openreach lines",null,"%",null,null,null,null,null,null,{"$f":"J10/J8","v":0.83505456697233815},{"$f":"K10/K8","v":0.85505456697233806},0.87505456697233808,0.89505456697233809,0.91001397098953907,0.92365246631670295,0.9356466360475052,0.94560073197478423,0.95429277755668052,0.96174825475974945,0.96807779751512524,0.97351384303544863,null,"WLA Volumes module"]
[]
["Total UK GEA broadband lines",null,"millions",0.32704009234327897,0.92491858333333321,2.0345887378122156,3.4098883333330003,5.0578365833333336,6.8822706229504051,8.8090189453060574,10.846912491073338,13.003251159155989,15.272051880677244,16.935957946877192,18.424749169168969,19.695112558308566,20.700529842456863,21.54913940220526,22.257448849546662,22.845144620881083,23.345712492521386,null,"WLA Volumes module"]
["Proportion of Openreach broadband lines that are GEA",null,"%",{"$f":"D13/D4","v":1.2317728969956062E-2},3.4530685724081203E-2,7.5301040914679027E-2,0.12502096698078052,0.18369101850402997,0.24756078619582406,{"$f":"J13/J4","v":0.31392263287711025},0.3830044336492372,0.45499281537448472,0.52964338185851467,0.58221618038086587,0.62802399739355275,0.66571615398788742,0.69390374792231124,0.71646577761644059,0.73399900260812689,0.7473985512347765,0.75786275631551903,null,"WLA Volumes module"]
[]
[]
["Lines adjusted for competitive network build"]
[]
["Total UK adjusted OR lines",null,"millions",24.363647085594017,24.467365761318998,24.758557808652156,24.925571303332987,25.094279193518332,24.998483730822798,24.871023094454955,24.69488514288398,24.530353389956161,24.359070570092037,24.509560238484255,24.659665978483432,24.808830894088125,24.960006676032531,25.111355430155065,25.265087688878534,25.41714613891169,25.567060702772334,null,"WLA Volumes module"]
[]
{"$rows_left_out":49}
{"sheet":"UBC inputs","index":8,"n_rows":23,"n_cols":11,"rows_kept":23,"cut":false,"hidden":false,"merged":[]}
["UBC inputs ",null,null,"Units"]
[]
[null,"Lines affected by LR-VDSL "]
[null,"Migration adsl",null,"One",null,{"$f":"INDEX([2]Calc_GeoVolumes!$F$11:$F$50,MATCH(B4,[2]Calc_GeoVolumes!$D$11:$D$50,0))","v":0}]
[]
[null,"UBC Premises",null,null,null,null,null,null,"Split by technology","%"]
[null,"VDSL Premises",null,"One",null,{"$f":"INDEX([2]Calc_GeoVolumes!$F$11:$F$50,MATCH(B7,[2]Calc_GeoVolumes!$D$11:$D$50,0))","v":1287955},null,null,"VDSL",{"$f":"F7/$F$12","v":0.68159471216435052}]
[null,"LR-VDSL Premises",null,"One",null,{"$f":"INDEX([2]Calc_GeoVolumes!$F$11:$F$50,MATCH(B8,[2]Calc_GeoVolumes!$D$11:$D$50,0))","v":0},null,null,"LR-VDSL",{"$f":"F8/$F$12","v":0}]
[null,"FTTP Premises",null,"One",null,{"$f":"INDEX([2]Calc_GeoVolumes!$F$11:$F$50,MATCH(B9,[2]Calc_GeoVolumes!$D$11:$D$50,0))","v":155258},null,null,"FTTC",{"$f":"SUM(F7:F8)/$F$12","v":0.68159471216435052},"FTTC_ratio"]
[null,"Gfast Premises",null,"One",null,{"$f":"INDEX([2]Calc_GeoVolumes!$F$11:$F$50,MATCH(B10,[2]Calc_GeoVolumes!$D$11:$D$50,0))","v":446407},null,null,"FTTP",{"$f":"F9/$F$12","v":8.2163609614631511E-2},"FTTP_ratio"]
[null,null,null,null,null,null,null,null,"Gfast",{"$f":"F10/$F$12","v":0.23624167822101799},"Gfast_ratio"]
[null,"Total fixed UBC premises",null,"One",null,{"$f":"SUM(F7:F10)","v":1889620},"Fixed_premises"]
[]
[null,"FWA Premises",null,"One",null,{"$f":"INDEX([2]Calc_GeoVolumes!$F$11:$F$50,MATCH(B14,[2]Calc_GeoVolumes!$D$11:$D$50,0))","v":469819}]
[null,"Satellite Premises",null,"One",null,{"$f":"INDEX([2]Calc_GeoVolumes!$F$11:$F$50,MATCH(B15,[2]Calc_GeoVolumes!$D$11:$D$50,0))","v":10210}]
[null,"Total wireless UBC premises",null,"One",null,{"$f":"SUM(F14:F15)","v":480029},"Wireless_premises"]
[null,"Total UBC premises",null,"One",null,{"$f":"F12+SUM(F14:F15)","v":2369649}]
[]
[null,"Premises from ADSL cabinets",null,"One",null,{"$f":"INDEX([2]Calc_GeoVolumes!$F$11:$F$50,MATCH(B19,[2]Calc_GeoVolumes!$D$11:$D$50,0))","v":1287955}]
[null,"Proportion of total UBC premises",null,null,null,{"$f":"F19/F17","v":0.5435214244810096}]
{"$rows_left_out":4}
{"sheet":"Calculations >","index":9,"n_rows":0,"n_cols":0,"rows_kept":0,"cut":false,"hidden":false,"merged":[]}

{"sheet":"Non-SFBB areas","index":10,"n_rows":35,"n_cols":19,"rows_kept":35,"cut":false,"hidden":false,"merged":[]}
["Non-SFBB areas"]
[]
[null,null,null,"Units",null,null,"2017/18","2018/19","2019/20","2020/21","2021/22","2022/23","2023/24","2024/25","2025/26","2026/27","2027/28","2028/29"]
[]
[null,"UBC Scenario"]
[null,{"$f":"UBC_scenario","v":"B1"}]
[]
[null,"Non-SFBB UBC premises",null,"millions",null,{"$f":"Non_SFBB_premises/million","v":1.0270489541278054}]
[]
[null,"Take up"]
[null,"2017/18",null,"%",null,null,0.1,0.1,0.1,0.1,0.1,0.1,0.1,0.1]
[null,"2018/19",null,"%",null,null,null,0.1,0.1,0.1,0.1,0.1,0.1,0.1,0.1]
[null,"2019/20",null,"%",null,null,null,null,0.1,0.1,0.1,0.1,0.1,0.1,0.1,0.1]
[null,"2020/21",null,"%",null,null,null,null,null,0.1,0.1,0.1,0.1,0.1,0.1,0.1,0.1]
[null,"2021/22",null,"%",null,null,null,null,null,null,0.1,0.1,0.1,0.1,0.1,0.1,0.1,0.1]
[null,"2022/23",null,"%",null,null,null,null,null,null,null,0.1,0.1,0.1,0.1,0.1,0.1,0.1]
[null,"2023/24",null,"%",null,null,null,null,null,null,null,null,0.1,0.1,0.1,0.1,0.1,0.1]
[null,"2024/25",null,"%",null,null,null,null,null,null,null,null,null,0.1,0.1,0.1,0.1,0.1]
[null,"2025/26",null,"%",null,null,null,null,null,null,null,null,null,null,0.1,0.1,0.1,0.1]
[null,"2026/27",null,"%",null,null,null,null,null,null,null,null,null,null,null,0.1,0.1,0.1]
{"$rows_left_out":16}
{"sheet":"SFBB areas ","index":11,"n_rows":40,"n_cols":19,"rows_kept":40,"cut":false,"hidden":false,"merged":[]}
["SFBB areas"]
[]
[null,null,null,"Units",null,null,"2017/18","2018/19","2019/20","2020/21","2021/22","2022/23","2023/24","2024/25","2025/26","2026/27","2027/28","2028/29"]
[]
[null,"UBC Scenario"]
[null,{"$f":"UBC_scenario","v":"B1"}]
[]
[null,"UBC premises",null,"millions",null,{"$f":"SFBB_premises/million","v":0.86257104587219469}]
[]
[null,"Take up gap",null,"%",null,{"$f":"Takeup_gap","v":0}]
[null,"% of take up gap to be closed",null,null,null,{"$f":"Takeup_gap_closed","v":0.5}]
[null,"UBC take up impact",null,null,null,{"$f":"F10*F11","v":0}]
[null,"Annual take-up",null,"%",null,{"$f":"F12/Catchup_period","v":0}]
[]
[null,"Take up"]
[null,"2017/18",null,"%",null,null,{"$f":"$F$13","v":0},0,0,0,0,0,0,0]
[null,"2018/19",null,"%",null,null,null,{"$f":"$F$13","v":0},0,0,0,0,0,0,0]
[null,"2019/20",null,"%",null,null,null,null,{"$f":"$F$13","v":0},0,0,0,0,0,0,0]
[null,"2020/21",null,"%",null,null,null,null,null,{"$f":"$F$13","v":0},0,0,0,0,0,0,0]
[null,"2021/22",null,"%",null,null,null,null,null,null,{"$f":"$F$13","v":0},0,0,0,0,0,0,0]
{"$rows_left_out":21}
{"sheet":"All areas","index":12,"n_rows":17,"n_cols":18,"rows_kept":17,"cut":false,"hidden":false,"merged":[]}
["All areas"]
[]
[null,null,null,"Units",null,"2017/18","2018/19","2019/20","2020/21","2021/22","2022/23","2023/24","2024/25","2025/26","2026/27","2027/28","2028/29"]
[]
[null,"UBC Scenario"]
[null,{"$f":"UBC_scenario","v":"B1"}]
[]
[null,"Total UBC subs",null,"millions"]
[null,"40/2 mgbit/s ",null,"millions",null,{"$f":"Subs_non_SFBB_split+Subs_SFBB_split","v":0},1.1395932758087291E-3,2.1999127214977375E-3,2.3014538724708904E-3,1.5603372545129302E-3,-3.7154665448751849E-4,-3.065043563034821E-3,-6.0672715464719432E-3,-9.3387491168960175E-3,-1.2293673245315532E-2,-1.4680063799764685E-2,-1.6399057035026844E-2]
[null,"40/10 mgbit/s",null,"millions",null,0,9.3335256884834392E-3,3.1465199890618308E-2,6.900654958573238E-2,0.12398196220545296,0.18304214057934873,0.24573618260583546,0.31093295708928875,0.37764031624858257,0.43073547146716334,0.46889244761178756,0.49124604923181669]
[null,"55/10 mgbit/s",null,"millions",null,0,8.0530647862649147E-3,2.2462128698665079E-2,4.1838084913897518E-2,6.4672069389294123E-2,8.5463392727259363E-2,0.10418594124049145,0.12140388055546132,0.13783549705885756,0.14841327388539013,0.15389511915023726,0.15480010059362131]
[null,"80/20 mgbit/s",null,"millions",null,0,7.150040102638055E-3,2.0901430248804288E-2,4.0911254747070025E-2,6.6547869682691316E-2,9.1333147292611244E-2,0.11531494907422034,0.13860735867201485,0.16144475599252925,0.17775541963542082,0.18785543648678901,0.1919920705118332]
[null,"Total",null,"millions",null,{"$f":"SUM(F9:F12)","v":0},{"$f":"SUM(G9:G12)","v":2.5676223853195138E-2},7.7028671559585399E-2,0.15405734311917083,0.25676223853195135,0.35946713394473184,0.46217202935751245,0.56487692477029294,0.66758182018307333,0.74461049174265881,0.79596293944904917,0.8216391633022444,"Total_UBC_subs"]
[]
[null,"Total UBC premises",null,"millions",null,{"$f":"'UBC inputs'!$F$12/million","v":1.8896200000000001},{"$f":"'UBC inputs'!$F$12/million","v":1.8896200000000001},{"$f":"'UBC inputs'!$F$12/million","v":1.8896200000000001},{"$f":"'UBC inputs'!$F$12/million","v":1.8896200000000001},{"$f":"'UBC inputs'!$F$12/million","v":1.8896200000000001},{"$f":"'UBC inputs'!$F$12/million","v":1.8896200000000001},{"$f":"'UBC inputs'!$F$12/million","v":1.8896200000000001},{"$f":"'UBC inputs'!$F$12/million","v":1.8896200000000001},{"$f":"'UBC inputs'!$F$12/million","v":1.8896200000000001},{"$f":"'UBC inputs'!$F$12/million","v":1.8896200000000001},{"$f":"'UBC inputs'!$F$12/million","v":1.8896200000000001},{"$f":"'UBC inputs'!$F$12/million","v":1.8896200000000001}]
[]
[null,"UBC Take up",null,"%",null,{"$f":"F13/F15","v":0},{"$f":"G13/G15","v":1.3588035612025241E-2},4.0764106836075717E-2,8.1528213672151448E-2,0.1358803561202524,0.19023249856835334,0.24458464101645433,0.29893678346455527,0.35328892591265615,0.39405303274873188,0.4212291039727824,0.43481713958480772,"UBC_takeup"]

{"sheet":"Ancillary services ","index":13,"n_rows":72,"n_cols":17,"rows_kept":72,"cut":false,"hidden":false,"merged":[]}
["Ancillary services"]
[]
[null,null,"Units ",null,"2017/18","2018/19","2019/20","2020/21","2021/22","2022/23","2023/24","2024/25","2025/26","2026/27","2027/28","2028/29"]
[]
["Total GEA rentals",null,"One",null,{"$f":"Total_UBC_subs*million","v":0},25676.223853195137,77028.671559585404,154057.34311917084,256762.23853195136,359467.13394473185,462172.02935751242,564876.92477029294,667581.82018307329,744610.49174265878,795962.93944904918,821639.16330224439]
["FTTC rentals",null,"One",null,{"$f":"E5*FTTC_ratio","v":0},17500.778406685971,52502.33522005791,105004.67044011583,175007.78406685969,245010.89769360353,315014.01132034743,385017.12494709133,455020.23857383506,507522.57379389304,542524.13060726505,560024.90901395108]
["FTTP rentals",null,"One",null,{"$f":"E5*FTTP_ratio","v":0},2109.6512330518149,6328.9536991554442,12657.90739831089,21096.512330518148,29535.117262725402,37973.722194932663,46412.327127139921,54850.932059347164,61179.885758502613,65399.18822460626,67508.839457658076]
["Gfast rentals",null,"One",null,{"$f":"E5*Gfast_ratio","v":0},6065.7942134573523,18197.382640372056,36394.765280744119,60657.942134573517,84921.118988402915,109184.29584223233,133447.47269606174,157710.6495498911,175908.03219026318,188039.62061717792,194105.41483063527]
[]
["Change in GEA rentals"]
["FTTC rentals",null,"One",null,{"$f":"E6-D6","v":0},{"$f":"F6-E6","v":17500.778406685971},35001.556813371935,52502.335220057925,70003.113626743856,70003.113626743841,70003.1136267439,70003.1136267439,70003.113626743725,52502.335220057983,35001.556813372008,17500.778406686033]
["FTTP rentals",null,"One",null,{"$f":"E7-D7","v":0},{"$f":"F7-E7","v":2109.6512330518149},4219.3024661036288,6328.953699155446,8438.6049322072577,8438.604932207254,8438.6049322072613,8438.6049322072577,8438.6049322072431,6328.9536991554487,4219.302466103647,2109.6512330518162]
["Gfast rentals",null,"One",null,{"$f":"E8-D8","v":0},6065.7942134573523,12131.588426914703,18197.382640372063,24263.176853829398,24263.176853829398,24263.176853829413,24263.176853829413,24263.176853829355,18197.382640372089,12131.588426914735,6065.7942134573532]
[]
["GEA Connections"]
["FTTC connections",null,"One",null,{"$f":"E11+E49","v":0},18900.840679220848,39201.743630976569,60902.708855267192,84003.73635209263,89603.985442232122,95204.234532371687,100804.48362251121,106404.73271265053,93104.141123569425,78403.487261953211,62302.771127802123]
["FTTP connections",null,"One",null,{"$f":"E12+E50","v":0},2278.4233316959599,4725.6187620360643,7341.5862910203168,10126.32591864871,10801.414313225287,11476.502707801874,12151.591102378452,12826.679496955017,11223.344559835657,9451.2375240721485,7510.3583896644623]
["Gfast connections",null,"One",null,{"$f":"E13+E51","v":0},6551.0577505339406,13587.379038144467,21108.963862831592,29115.81222459528,31056.866372901633,32997.920521207998,34938.974669514355,36880.028817820639,32270.025215593145,27174.75807628897,21594.227399908174]
[]
[]
{"$rows_left_out":53}
{"sheet":"Indirect benefits","index":14,"n_rows":88,"n_cols":19,"rows_kept":88,"cut":false,"hidden":false,"merged":[]}
[]
["Indirect benefits",null,null,null,"Units",null,"2017/18","2018/19","2019/20","2020/21","2021/22","2022/23","2023/24","2024/25","2025/26","2026/27","2027/28","2028/29"]
[]
[]
[null,"GEA rentals"]
[]
[null,null,"Non-SFBB areas"]
[]
[null,null,null,"UBC volumes"]
[null,null,null,"40/2 mgbit/s ","One",null,{"$f":"'Non-SFBB areas'!G31:R34*million","v":0},1139.593275808729,2199.9127214977375,2301.4538724708905,1560.3372545129303,-371.54665448751848,-3065.0435630348211,-6067.2715464719431,-9338.7491168960169,-12293.673245315531,-14680.063799764685,-16399.057035026843]
[null,null,null,"40/10 mgbit/s","One",null,0,9333.5256884834398,31465.199890618307,69006.549585732384,123981.96220545296,183042.14057934872,245736.18260583546,310932.95708928874,377640.31624858256,430735.47146716336,468892.44761178753,491246.04923181672]
[null,null,null,"55/10 mgbit/s","One",null,0,8053.0647862649148,22462.128698665078,41838.084913897517,64672.06938929412,85463.392727259357,104185.94124049145,121403.88055546132,137835.49705885755,148413.27388539014,153895.11915023727,154800.10059362132]
[null,null,null,"80/20 mgbit/s","One",null,0,7150.040102638055,20901.430248804289,40911.254747070023,66547.869682691322,91333.147292611247,115314.94907422033,138607.35867201485,161444.75599252924,177755.41963542081,187855.43648678903,191992.07051183321]
[]
[null,null,null,"Expected unit prices"]
[null,null,null,"40/2 mgbit/s ","One",null,{"$f":"GEA_rental_prices","v":82.8},60.614140136673392,51.617739631570203,47.433867837837042,47.433867837837042,47.433867837837042,47.433867837837042,47.433867837837042,47.433867837837042,47.433867837837042,47.433867837837042,47.433867837837042]
[null,null,null,"40/10 mgbit/s","One",null,88.8,65.006469132084504,55.358155546901372,50.871104637680304,50.871104637680304,50.871104637680304,50.871104637680304,50.871104637680304,50.871104637680304,50.871104637680304,50.871104637680304,50.871104637680304]
[null,null,null,"55/10 mgbit/s","One",null,100.8,73.79112712290673,62.838987377563718,57.745578237366828,57.745578237366828,57.745578237366828,57.745578237366828,57.745578237366828,57.745578237366828,57.745578237366828,57.745578237366828,57.745578237366828]
[null,null,null,"80/20 mgbit/s","One",null,119.4,87.407347008681199,74.434276715090363,68.401012316880951,68.401012316880951,68.401012316880951,68.401012316880951,68.401012316880951,68.401012316880951,68.401012316880951,68.401012316880951,68.401012316880951]
[]
{"$rows_left_out":68}